Target
Neprilysin
Ligand
BDBM50038631
Substrate
Meas. Tech.
ChEMBL_144465 (CHEMBL755112)
IC50
150±n/a nM
Citation
 Gomez-Monterrey, IBeaumont, ANemecek, PRoques, BPFournie-Zaluski, MC New thiol inhibitors of neutral endopeptidase EC 3.4.24.11: synthesis and enzyme active-site recognition. J Med Chem 37:1865-73 (1994)  
Target
Name:
Neprilysin
Synonyms:
Atriopeptidase CD_antigen=CD10 MME NEP_RABIT Neutral endopeptidase 24.11
Type:
Enzyme
Mol. Mass.:
85570.75
Organism:
Oryctolagus cuniculus (rabbit)
Description:
NEP was purified to homogeneity from rabbit kidney.
Residue:
750
  
Inhibitor
Name:
BDBM50038631
Synonyms:
2-(2-Benzyl-4-mercapto-5-phenyl-pentanoylamino)-3-(4-hydroxy-phenyl)-propionic acid | CHEMBL301703
Type:
Small organic molecule
Emp. Form.:
C27H29NO4S
Mol. Mass.:
463.588
SMILES:
OC(=O)C(Cc1ccc(O)cc1)NC(=O)C(CC(S)Cc1ccccc1)Cc1ccccc1
: