Target
Neprilysin
Ligand
BDBM50038626
Substrate
Meas. Tech.
ChEMBL_144465 (CHEMBL755112)
IC50
220±n/a nM
Citation
 Gomez-Monterrey, IBeaumont, ANemecek, PRoques, BPFournie-Zaluski, MC New thiol inhibitors of neutral endopeptidase EC 3.4.24.11: synthesis and enzyme active-site recognition. J Med Chem 37:1865-73 (1994)  
Target
Name:
Neprilysin
Synonyms:
Atriopeptidase CD_antigen=CD10 MME NEP_RABIT Neutral endopeptidase 24.11
Type:
Enzyme
Mol. Mass.:
85570.75
Organism:
Oryctolagus cuniculus (rabbit)
Description:
NEP was purified to homogeneity from rabbit kidney.
Residue:
750
  
Inhibitor
Name:
BDBM50038626
Synonyms:
5-Benzyl-3-sec-butyl-dihydro-thiophen-2-one | CHEMBL55103
Type:
Small organic molecule
Emp. Form.:
C15H20OS
Mol. Mass.:
248.384
SMILES:
CCC(C)C1CC(Cc2ccccc2)SC1=O
: