Target
Thermolysin
Ligand
BDBM50422014
Substrate
Meas. Tech.
ChEMBL_210391 (CHEMBL812111)
Ki
50±n/a nM
Citation
 Gomez-Monterrey, IBeaumont, ANemecek, PRoques, BPFournie-Zaluski, MC New thiol inhibitors of neutral endopeptidase EC 3.4.24.11: synthesis and enzyme active-site recognition. J Med Chem 37:1865-73 (1994)  
Target
Name:
Thermolysin
Synonyms:
THER_BACTH | npr
Type:
PROTEIN
Mol. Mass.:
60097.54
Organism:
Bacillus thermoproteolyticus
Description:
ChEMBL_1468794
Residue:
548
  
Inhibitor
Name:
BDBM50422014
Synonyms:
CHEMBL319299
Type:
Small organic molecule
Emp. Form.:
C27H33N3O5
Mol. Mass.:
479.568
SMILES:
CC(C)C[C@H](NC(CCc1ccccc1)C(O)=O)C(=O)N[C@@H](Cc1c[nH]c2ccccc12)C(O)=O
: