Target
Muscarinic acetylcholine receptor M1
Ligand
BDBM50038710
Substrate
Meas. Tech.
ChEMBL_139959 (CHEMBL749014)
Ki
1470±n/a nM
Citation
 Hudkins, RLMailman, RBDeHaven-Hudkins, DL Novel (4-phenylpiperidinyl)- and (4-phenylpiperazinyl)alkyl-spaced esters of 1-phenylcyclopentanecarboxylic acids as potent sigma-selective compounds. J Med Chem 37:1964-70 (1994)  
Target
Name:
Muscarinic acetylcholine receptor M1
Synonyms:
ACM1_RAT Chrm-1 cholinergic receptor, muscarinic 1
Type:
Enzyme Catalytic Domain
Mol. Mass.:
51390.46
Organism:
RAT
Description:
P08482
Residue:
460
  
Inhibitor
Name:
BDBM50038710
Synonyms:
1-Phenyl-cyclopentanecarboxylic acid 2-(4-phenyl-piperazin-1-yl)-ethyl ester; hydrochloride | CHEMBL537989
Type:
Small organic molecule
Emp. Form.:
C24H30N2O2
Mol. Mass.:
378.5072
SMILES:
O=C(OCCN1CCN(CC1)c1ccccc1)C1(CCCC1)c1ccccc1
: