Target
Aldo-keto reductase family 1 member B1
Ligand
BDBM50038839
Substrate
Meas. Tech.
ChEMBL_31756 (CHEMBL645284)
IC50
19±n/a nM
Citation
 Malamas, MSHohman, TCMillen, J Novel spirosuccinimide aldose reductase inhibitors derived from isoquinoline-1,3-diones: 2-[(4-bromo-2-fluorophenyl)methyl]-6- fluorospiro[isoquinoline-4(1H),3'-pyrrolidine]-1,2',3,5'(2H)-tetrone and congeners. 1. J Med Chem 37:2043-58 (1994)  
Target
Name:
Aldo-keto reductase family 1 member B1
Synonyms:
AKR1B1 ALDR_HUMAN AR Aldose Reductase (ALR2) Aldose reductase (AR)
Type:
Protein
Mol. Mass.:
35855.50
Organism:
Homo sapiens (Human)
Description:
P15121. 4LAU; 2IKI; 4LB4; 2FZD; 2FZ8; 1US0
Residue:
316
  
Inhibitor
Name:
BDBM50038839
Synonyms:
2-(4-bromo-2-fluorobenzyl)-1H,2'H,5'H-spiro[isoquinoline-4,3'-pyrrolidine]-1,2',3,5'(2H)-tetrone CHEMBL62685
Type:
Small organic molecule
Emp. Form.:
C19H12BrFN2O4
Mol. Mass.:
431.212
SMILES:
Fc1cc(Br)ccc1CN1C(=O)c2ccccc2C2(CC(=O)NC2=O)C1=O
: