Target
Aldo-keto reductase family 1 member B1 [K65Q]
Ligand
BDBM50038863
Substrate
Meas. Tech.
ChEMBL_31334 (CHEMBL645541)
IC50
28±n/a nM
Citation
 Malamas, MSHohman, TCMillen, J Novel spirosuccinimide aldose reductase inhibitors derived from isoquinoline-1,3-diones: 2-[(4-bromo-2-fluorophenyl)methyl]-6- fluorospiro[isoquinoline-4(1H),3'-pyrrolidine]-1,2',3,5'(2H)-tetrone and congeners. 1. J Med Chem 37:2043-58 (1994)  
Target
Name:
Aldo-keto reductase family 1 member B1 [K65Q]
Synonyms:
AKR1B1 Aldose reductase
Type:
Protein
Mol. Mass.:
35916.27
Organism:
Bos taurus (Cattle)
Description:
P16116[K65Q]
Residue:
315
  
Inhibitor
Name:
BDBM50038863
Synonyms:
6-bromo-2-(4-bromo-2-fluorobenzyl)-7-methoxy-1H,2'H,5'H-spiro[isoquinoline-4,3'-pyrrolidine]-1,2',3,5'(2H)-tetrone | CHEMBL291355
Type:
Small organic molecule
Emp. Form.:
C20H13Br2FN2O5
Mol. Mass.:
540.134
SMILES:
COc1cc2C(=O)N(Cc3ccc(Br)cc3F)C(=O)C3(CC(=O)NC3=O)c2cc1Br
: