Target
Mu-type opioid receptor
Ligand
BDBM50009146
Substrate
Meas. Tech.
ChEMBL_138725 (CHEMBL747114)
IC50
15000±n/a nM
Citation
 Calderon, SNRothman, RBPorreca, FFlippen-Anderson, JLMcNutt, RWXu, HSmith, LEBilsky, EJDavis, PRice, KC Probes for narcotic receptor mediated phenomena. 19. Synthesis of (+)-4-[(alpha R)-alpha-((2S,5R)-4-allyl-2,5-dimethyl-1-piperazinyl)-3- methoxybenzyl]-N,N-diethylbenzamide (SNC 80): a highly selective, nonpeptide delta opioid receptor agonist. J Med Chem 37:2125-8 (1994)  
Target
Name:
Mu-type opioid receptor
Synonyms:
M-OR-1 Mu opioid receptor OPIATE Mu OPRM_CAVPO
Type:
Enzyme Catalytic Domain
Mol. Mass.:
11165.58
Organism:
GUINEA PIG
Description:
P97266
Residue:
98
  
Inhibitor
Name:
BDBM50009146
Synonyms:
(S)-4-((S)-2-{(R)-2-[(S)-2-Amino-3-(4-hydroxy-phenyl)-propionylamino]-propionylamino}-3-phenyl-propionylamino)-4-{(S)-1-[(S)-1-(carboxymethyl-carbamoyl)-2-methyl-propylcarbamoyl]-2-methyl-propylcarbamoyl}-butyric acid CHEMBL26575
Type:
Small organic molecule
Emp. Form.:
C38H53N7O11
Mol. Mass.:
783.8677
SMILES:
CC(C)[C@H](NC(=O)[C@@H](NC(=O)[C@H](CCC(O)=O)NC(=O)[C@H](Cc1ccccc1)NC(=O)[C@@H](C)NC(=O)[C@@H](N)Cc1ccc(O)cc1)C(C)C)C(=O)NCC(O)=O
: