Target
Sodium-dependent dopamine transporter
Ligand
BDBM50039172
Substrate
Meas. Tech.
ChEMBL_49345 (CHEMBL662482)
IC50
260±n/a nM
Citation
 Kline, RHEshleman, AJWright, JEldefrawi, ME Synthesis of substituted 3-carbamoylecgonine methyl ester analogues: irreversible and photoaffinity ligands for the cocaine receptor/dopamine transporter. J Med Chem 37:2249-52 (1994)  
Target
Name:
Sodium-dependent dopamine transporter
Synonyms:
DA transporter SC6A3_RAT Sodium-dependent dopamine transporter | Sodium-dependent dopamine transporter (DAT)
Type:
Multi-pass membrane protein
Mol. Mass.:
68749.45
Organism:
Rattus norvegicus (rat)
Description:
P23977
Residue:
619
  
Inhibitor
Name:
BDBM50039172
Synonyms:
(R)-3-(4-Isothiocyanato-phenylcarbamoyloxy)-8-methyl-8-aza-bicyclo[3.2.1]octane-2-carboxylic acid methyl ester | CHEMBL312071
Type:
Small organic molecule
Emp. Form.:
C18H21N3O4S
Mol. Mass.:
375.442
SMILES:
COC(=O)C1C2CC[C@H](CC1OC(=O)Nc1ccc(cc1)N=C=S)N2C
: