Target
D(2) dopamine receptor
Ligand
BDBM50010617
Substrate
Meas. Tech.
ChEMBL_63048 (CHEMBL679938)
Ki
8.5±n/a nM
Citation
 Sonesson, CLin, CHHansson, LWaters, NSvensson, KCarlsson, ASmith, MWWikström, H Substituted (S)-phenylpiperidines and rigid congeners as preferential dopamine autoreceptor antagonists: synthesis and structure-activity relationships. J Med Chem 37:2735-53 (1994)  
Target
Name:
D(2) dopamine receptor
Synonyms:
D(2) dopamine receptor DOPAMINE D2 Long DRD2 Dopamine D2 receptor Dopamine D2 receptor (D2R) Dopamine2-like | d2
Type:
Cell-surface receptors
Mol. Mass.:
50647.10
Organism:
Homo sapiens (Human)
Description:
P14416
Residue:
443
  
Inhibitor
Name:
BDBM50010617
Synonyms:
(-)-3-(1-Propyl-piperidin-3-yl)-phenol 3-((S)-1-Propyl-piperidin-3-yl)-phenol 3PPP,(+) Preclamol
Type:
Small organic molecule
Emp. Form.:
C14H21NO
Mol. Mass.:
219.3226
SMILES:
CCCN1CCC[C@H](C1)c1cccc(O)c1
: