Target
D(2) dopamine receptor
Ligand
BDBM50039740
Substrate
Meas. Tech.
ChEMBL_63043 (CHEMBL678345)
Ki
3440±n/a nM
Citation
 Sonesson, CLin, CHHansson, LWaters, NSvensson, KCarlsson, ASmith, MWWikström, H Substituted (S)-phenylpiperidines and rigid congeners as preferential dopamine autoreceptor antagonists: synthesis and structure-activity relationships. J Med Chem 37:2735-53 (1994)  
Target
Name:
D(2) dopamine receptor
Synonyms:
DOPAMINE D2 DOPAMINE D2 Short Dopamine D2 receptor Drd2
Type:
G Protein-Coupled Receptor (GPCR)
Mol. Mass.:
50931.60
Organism:
Rattus norvegicus (rat)
Description:
P61169
Residue:
444
  
Inhibitor
Name:
BDBM50039740
Synonyms:
(S)-3-(3-Methoxy-phenyl)-1-propyl-piperidine | CHEMBL93582
Type:
Small organic molecule
Emp. Form.:
C15H23NO
Mol. Mass.:
233.3492
SMILES:
CCCN1CCC[C@H](C1)c1cccc(OC)c1
: