Target
5-hydroxytryptamine receptor 1A
Ligand
BDBM50039810
Substrate
Meas. Tech.
ChEMBL_1445 (CHEMBL616569)
Ki
0.46±n/a nM
Citation
 van Steen, BJvan Wijngaarden, ITulp, MTSoudijn, W Structure-affinity relationship studies on 5-HT1A receptor ligands. 2. Heterobicyclic phenylpiperazines with N4-aralkyl substituents. J Med Chem 37:2761-73 (1994)  
Target
Name:
5-hydroxytryptamine receptor 1A
Synonyms:
5-HT-1A 5-HT1A 5-hydroxytryptamine receptor 1A (5HT1A) 5ht1a Htr1a Serotonin 1a (5-HT1a) receptor/Adrenergic receptor alpha-1 | Serotonin receptor 1A
Type:
G Protein-Coupled Receptor (GPCR)
Mol. Mass.:
46445.29
Organism:
Rattus norvegicus (rat)
Description:
Binding assays were performed using rat hippocampal membranes.
Residue:
422
  
Inhibitor
Name:
BDBM50039810
Synonyms:
1-Benzofuran-7-yl-4-(2-phenoxy-ethyl)-piperazine; hydrochloride | CHEMBL543141
Type:
Small organic molecule
Emp. Form.:
C20H22N2O2
Mol. Mass.:
322.4009
SMILES:
C(CN1CCN(CC1)c1cccc2ccoc12)Oc1ccccc1
: