Target
5-hydroxytryptamine receptor 1A
Ligand
BDBM50039821
Substrate
Meas. Tech.
ChEMBL_1445 (CHEMBL616569)
Ki
0.44±n/a nM
Citation
 van Steen, BJvan Wijngaarden, ITulp, MTSoudijn, W Structure-affinity relationship studies on 5-HT1A receptor ligands. 2. Heterobicyclic phenylpiperazines with N4-aralkyl substituents. J Med Chem 37:2761-73 (1994)  
Target
Name:
5-hydroxytryptamine receptor 1A
Synonyms:
5-HT-1A 5-HT1A 5-hydroxytryptamine receptor 1A (5HT1A) 5ht1a Htr1a Serotonin 1a (5-HT1a) receptor/Adrenergic receptor alpha-1 | Serotonin receptor 1A
Type:
G Protein-Coupled Receptor (GPCR)
Mol. Mass.:
46445.29
Organism:
Rattus norvegicus (rat)
Description:
Binding assays were performed using rat hippocampal membranes.
Residue:
422
  
Inhibitor
Name:
BDBM50039821
Synonyms:
CHEMBL93421 | Cyclohexanecarboxylic acid {2-[4-(2,3-dihydro-benzo[1,4]dioxin-5-yl)-piperazin-1-yl]-ethyl}-amide
Type:
Small organic molecule
Emp. Form.:
C21H31N3O3
Mol. Mass.:
373.4891
SMILES:
O=C(NCCN1CCN(CC1)c1cccc2OCCOc12)C1CCCCC1
: