Target
Kappa-type opioid receptor
Ligand
BDBM50018708
Substrate
Meas. Tech.
ChEMBL_145937 (CHEMBL748540)
IC50
600±n/a nM
Citation
 Weerawarna, SADavis, RDNelson, WL Isothiocyanate-substituted kappa-selective opioid receptor ligands derived from N-methyl-N-[(1S)-1-phenyl-2-(1-pyrrolidinyl)ethyl] phenylacetamide. J Med Chem 37:2856-64 (1994)  
Target
Name:
Kappa-type opioid receptor
Synonyms:
Kappa Opioid Receptor OPRK1 Opiate Kappa 1 | mu/kappa opioid receptor
Type:
G Protein-Coupled Receptor (GPCR)
Mol. Mass.:
42744.99
Organism:
Cavia porcellus (domestic guinea pig)
Description:
P41144
Residue:
380
  
Inhibitor
Name:
BDBM50018708
Synonyms:
2-{2-[2-(2-{2-[2-Amino-3-(4-hydroxy-phenyl)-propionylamino]-3-hydroxy-propionylamino}-acetylamino)-3-phenyl-propionylamino]-4-methyl-pentanoylamino}-3-hydroxy-butyric acid DSLET Tyr-D-Ser-Gly-Phe-Leu-Thr
Type:
Small organic molecule
Emp. Form.:
C33H46N6O10
Mol. Mass.:
686.7525
SMILES:
CC(C)C[C@H](NC(=O)[C@H](Cc1ccccc1)NC(=O)CNC(=O)[C@@H](CO)NC(=O)[C@@H](N)Cc1ccc(O)cc1)C(=O)N[C@@H]([C@@H](C)O)C(O)=O
: