Target
Sodium-dependent dopamine transporter
Ligand
BDBM50006239
Substrate
Meas. Tech.
ChEMBL_62180 (CHEMBL672119)
IC50
1.4±n/a nM
Citation
 Carroll, FIMascarella, SWKuzemko, MAGao, YAbraham, PLewin, AHBoja, JWKuhar, MJ Synthesis, ligand binding, and QSAR (CoMFA and classical) study of 3 beta-(3'-substituted phenyl)-, 3 beta-(4'-substituted phenyl)-, and 3 beta-(3',4'-disubstituted phenyl)tropane-2 beta-carboxylic acid methyl esters. J Med Chem 37:2865-73 (1994)  
Target
Name:
Sodium-dependent dopamine transporter
Synonyms:
DA transporter SC6A3_RAT Sodium-dependent dopamine transporter | Sodium-dependent dopamine transporter (DAT)
Type:
Multi-pass membrane protein
Mol. Mass.:
68749.45
Organism:
Rattus norvegicus (rat)
Description:
P23977
Residue:
619
  
Inhibitor
Name:
BDBM50006239
Synonyms:
3-(4-Amino-3-iodo-phenyl)-8-methyl-8-aza-bicyclo[3.2.1]octane-2-carboxylic acid methyl ester | methyl (2S,3S)-3-(4-amino-3-iodophenyl)-8-methyl-8-azabicyclo[3.2.1]octane-2-carboxylate
Type:
Small organic molecule
Emp. Form.:
C16H21IN2O2
Mol. Mass.:
400.2546
SMILES:
COC(=O)[C@@H]1C2CCC(C[C@@H]1c1ccc(N)c(I)c1)N2C
: