Target
Vasopressin V2 receptor
Ligand
BDBM50030077
Substrate
Meas. Tech.
ChEMBL_215172 (CHEMBL821345)
Kd
811±n/a nM
Citation
 Pavo, ISlaninova, JKlein, UFahrenholz, F Enhanced selectivity of oxytocin antagonists containing sarcosine in position 7. J Med Chem 37:255-9 (1994)  
Target
Name:
Vasopressin V2 receptor
Synonyms:
AVPR2 VASOPRESSIN V2 | Vasopressin V2 receptor
Type:
Enzyme Catalytic Domain
Mol. Mass.:
40248.83
Organism:
BOVINE
Description:
VASOPRESSIN V2 AVPR2 BOVINE::P48044
Residue:
370
  
Inhibitor
Name:
BDBM50030077
Synonyms:
CHEMBL330022 | [Mca1,D-Tyr(OMe)2,Sar7]AVT
Type:
Small organic molecule
Emp. Form.:
C41H61N11O12S2
Mol. Mass.:
964.12
SMILES:
CC[C@H](C)[C@@H]1NC(=O)[C@H](Cc2ccc(OC)cc2)NC(=O)CCSSC[C@@H](NC(=O)[C@H](CC(N)=O)NC(=O)[C@H](CCC(N)=O)NC1=O)C(=O)N1CCC[C@H]1C(=O)N(C)CC(=O)NCC(N)=O
: