Target
Sodium channel protein type 2 subunit alpha
Ligand
BDBM50043988
Substrate
Meas. Tech.
ChEMBL_144081 (CHEMBL753044)
IC50
106000±n/a nM
Citation
 Roufos, IHays, SJDooley, DJSchwarz, RDCampbell, GWProbert, AW Synthesis and pharmacological evaluation of phenylacetamides as sodium-channel blockers. J Med Chem 37:268-74 (1994)  
Target
Name:
Sodium channel protein type 2 subunit alpha
Synonyms:
SCN2A_RAT Scn2a1 Sodium channel protein type 2 subunit alpha Sodium channel protein type II subunit alpha Voltage-gated sodium channel | Voltage-gated sodium channel subunit alpha Nav1.2
Type:
PROTEIN
Mol. Mass.:
227854.11
Organism:
Rattus norvegicus
Description:
ChEMBL_1516893
Residue:
2005
  
Inhibitor
Name:
BDBM50043988
Synonyms:
3-[3-(2,6-Dimethyl-piperidin-1-yl)-propyl]-1,1-diphenyl-urea | CHEMBL94137
Type:
Small organic molecule
Emp. Form.:
C23H31N3O
Mol. Mass.:
365.5117
SMILES:
CC1CCCC(C)N1CCCNC(=O)N(c1ccccc1)c1ccccc1
: