Target
Cholecystokinin receptor type A
Ligand
BDBM50044044
Substrate
Meas. Tech.
ChEMBL_49581 (CHEMBL661234)
IC50
2±n/a nM
Citation
 Elliott, RLKopecka, HBennett, MJShue, YKCraig, RLin, CWBianchi, BRMiller, TRWitte, DGStashko, MA Tetrapeptide CCK agonists: structure-activity studies on modifications at the N-terminus. J Med Chem 37:309-13 (1994)  
Target
Name:
Cholecystokinin receptor type A
Synonyms:
CCK-A receptor CCK1-R CCKAR_CAVPO Cholecystokinin receptor type A | Cholecystokinin-1 receptor
Type:
Mol. Mass.:
48229.77
Organism:
Cavia porcellus
Description:
Residue:
430
  
Inhibitor
Name:
BDBM50044044
Synonyms:
(S)-N-((S)-1-Carbamoyl-2-phenyl-ethyl)-3-[(S)-2-((S)-3-1H-indol-3-yl-2-propionylamino-propionylamino)-6-(3-o-tolyl-ureido)-hexanoylamino]-N-methyl-succinamic acid | CHEMBL420667
Type:
Small organic molecule
Emp. Form.:
C42H52N8O8
Mol. Mass.:
796.9111
SMILES:
CCC(=O)N[C@@H](Cc1c[nH]c2ccccc12)C(=O)N[C@@H](CCCCNC(=O)Nc1ccccc1C)C(=O)N[C@@H](CC(O)=O)C(=O)N(C)[C@@H](Cc1ccccc1)C(N)=O
: