Target
Cholecystokinin receptor type A
Ligand
BDBM50044027
Substrate
Meas. Tech.
ChEMBL_49581 (CHEMBL661234)
IC50
19±n/a nM
Citation
 Elliott, RLKopecka, HBennett, MJShue, YKCraig, RLin, CWBianchi, BRMiller, TRWitte, DGStashko, MA Tetrapeptide CCK agonists: structure-activity studies on modifications at the N-terminus. J Med Chem 37:309-13 (1994)  
Target
Name:
Cholecystokinin receptor type A
Synonyms:
CCK-A receptor CCK1-R CCKAR_CAVPO Cholecystokinin receptor type A | Cholecystokinin-1 receptor
Type:
Mol. Mass.:
48229.77
Organism:
Cavia porcellus
Description:
Residue:
430
  
Inhibitor
Name:
BDBM50044027
Synonyms:
(S)-3-[(S)-2-[(S)-2-(2-Adamantan-1-yl-acetylamino)-3-1H-indol-3-yl-propionylamino]-6-(3-o-tolyl-ureido)-hexanoylamino]-N-((S)-1-carbamoyl-2-phenyl-ethyl)-N-methyl-succinamic acid | CHEMBL320854
Type:
Small organic molecule
Emp. Form.:
C51H64N8O8
Mol. Mass.:
917.1027
SMILES:
CN([C@@H](Cc1ccccc1)C(N)=O)C(=O)[C@H](CC(O)=O)NC(=O)[C@H](CCCCNC(=O)Nc1ccccc1C)NC(=O)[C@H](Cc1c[nH]c2ccccc12)NC(=O)CC12CC3CC(CC(C3)C1)C2
: