Target
Gastrin/cholecystokinin type B receptor
Ligand
BDBM50044024
Substrate
Meas. Tech.
ChEMBL_47833 (CHEMBL662575)
IC50
3500±n/a nM
Citation
 Elliott, RLKopecka, HBennett, MJShue, YKCraig, RLin, CWBianchi, BRMiller, TRWitte, DGStashko, MA Tetrapeptide CCK agonists: structure-activity studies on modifications at the N-terminus. J Med Chem 37:309-13 (1994)  
Target
Name:
Gastrin/cholecystokinin type B receptor
Synonyms:
CCK-2 receptor CCK-BR CCKRB Cholecystokinin receptor GASR_HUMAN | Gastrin/cholecystokinin type B receptor
Type:
G Protein-Coupled Receptor (GPCR)
Mol. Mass.:
48445.79
Organism:
Homo sapiens (Human)
Description:
Stable expression of human CCK-2 receptors in HEK 293 cells.
Residue:
447
  
Inhibitor
Name:
BDBM50044024
Synonyms:
(S)-3-[(S)-2-[2-((S)-3-tert-Butyl-ureido)-3-(1H-indol-3-yl)-propionylamino]-6-(3-o-tolyl-ureido)-hexanoylamino]-N-((S)-1-carbamoyl-2-phenyl-ethyl)-N-methyl-succinamic acid | CHEMBL318570
Type:
Small organic molecule
Emp. Form.:
C44H57N9O8
Mol. Mass.:
839.9789
SMILES:
CN([C@@H](Cc1ccccc1)C(N)=O)C(=O)[C@H](CC(O)=O)NC(=O)[C@H](CCCCNC(=O)Nc1ccccc1C)NC(=O)[C@H](Cc1c[nH]c2ccccc12)NC(=O)NC(C)(C)C
: