Target
Sigma non-opioid intracellular receptor 1
Ligand
BDBM50044055
Substrate
Meas. Tech.
ChEMBL_200977 (CHEMBL802064)
Ki
29±n/a nM
Citation
 de Costa, BRHe, XSDominguez, CCutts, JWilliams, WBowen, WD A new approach to the design of sigma-2-selective ligands: synthesis and evaluation of N-[2-(3,4-dichlorophenyl)ethyl]-N-methyl-2-(1- pyrrolidinyl)ethylamine-related polyamines at sigma-1 and sigma-2 receptor subtypes. J Med Chem 37:314-21 (1994)  
Target
Name:
Sigma non-opioid intracellular receptor 1
Synonyms:
Aging-associated gene 8 protein SGMR1_HUMAN SIGMAR1 SR31747-binding protein Sigma 1-type opioid receptor Sigma1R | hSigmaR1
Type:
Enzyme Catalytic Domain
Mol. Mass.:
25124.85
Organism:
Homo sapiens (Human)
Description:
Q99720
Residue:
223
  
Inhibitor
Name:
BDBM50044055
Synonyms:
1-[2-(3,4-Dichloro-phenyl)-ethyl]-pyrrolidine; hydrobromide | CHEMBL543632
Type:
Small organic molecule
Emp. Form.:
C12H15Cl2N
Mol. Mass.:
244.16
SMILES:
Clc1ccc(CCN2CCCC2)cc1Cl
: