Target
Delta-type opioid receptor
Ligand
BDBM50037486
Substrate
Meas. Tech.
ChEMBL_146612 (CHEMBL750113)
Ki
2934±n/a nM
Citation
 May, ELAceto, MDBowman, ERBentley, CMartin, BRHarris, LSMedzihradsky, FMattson, MVJacobson, AE Antipodal alpha-N-(methyl through decyl)-N-normetazocines (5,9 alpha-dimethyl-2'-hydroxy-6,7-benzomorphans): in vitro and in vivo properties. J Med Chem 37:3408-18 (1994)  
Target
Name:
Delta-type opioid receptor
Synonyms:
D-OR-1 Delta opioid receptor OPIATE Delta OPRD1 OPRK1 | opioid receptor, delta 1
Type:
G Protein-Coupled Receptor (GPCR)
Mol. Mass.:
40382.98
Organism:
Homo sapiens (Human)
Description:
Competition binding assays were carried out using membrane preparations from transfected HN9.10 cells that constitutively expressed the delta opioid receptor.
Residue:
372
  
Inhibitor
Name:
BDBM50037486
Synonyms:
(6S,11S)-6,11-Dimethyl-3-nonyl-1,2,3,4,5,6-hexahydro-2,6-methano-benzo[d]azocin-8-ol | CHEMBL117321
Type:
Small organic molecule
Emp. Form.:
C23H37NO
Mol. Mass.:
343.546
SMILES:
CCCCCCCCCN1CC[C@@]2(C)[C@H](C)C1Cc1ccc(O)cc21
: