Target
Mu-type opioid receptor
Ligand
BDBM50037485
Substrate
Meas. Tech.
ChEMBL_136061 (CHEMBL746681)
Ki
15±n/a nM
Citation
 May, ELAceto, MDBowman, ERBentley, CMartin, BRHarris, LSMedzihradsky, FMattson, MVJacobson, AE Antipodal alpha-N-(methyl through decyl)-N-normetazocines (5,9 alpha-dimethyl-2'-hydroxy-6,7-benzomorphans): in vitro and in vivo properties. J Med Chem 37:3408-18 (1994)  
Target
Name:
Mu-type opioid receptor
Synonyms:
M-OR-1 MOR-1 MUOR1 Mu opiate receptor OPRM1 hMOP | mu-type opioid receptor isoform MOR-1
Type:
G Protein-Coupled Receptor (GPCR)
Mol. Mass.:
44789.51
Organism:
Homo sapiens (Human)
Description:
P35372
Residue:
400
  
Inhibitor
Name:
BDBM50037485
Synonyms:
(6S,11R)-6,11-Dimethyl-3-pentyl-1,2,3,4,5,6-hexahydro-2,6-methano-benzo[d]azocin-8-ol | CHEMBL117183
Type:
Small organic molecule
Emp. Form.:
C19H29NO
Mol. Mass.:
287.4397
SMILES:
CCCCCN1CC[C@@]2(C)[C@@H](C)C1Cc1ccc(O)cc21
: