Target
Sigma non-opioid intracellular receptor 1
Ligand
BDBM50037486
Substrate
Meas. Tech.
ChEMBL_201749 (CHEMBL809883)
Ki
12±n/a nM
Citation
 May, ELAceto, MDBowman, ERBentley, CMartin, BRHarris, LSMedzihradsky, FMattson, MVJacobson, AE Antipodal alpha-N-(methyl through decyl)-N-normetazocines (5,9 alpha-dimethyl-2'-hydroxy-6,7-benzomorphans): in vitro and in vivo properties. J Med Chem 37:3408-18 (1994)  
Target
Name:
Sigma non-opioid intracellular receptor 1
Synonyms:
Aging-associated gene 8 protein SGMR1_HUMAN SIGMAR1 SR31747-binding protein Sigma 1-type opioid receptor Sigma1R | hSigmaR1
Type:
Enzyme Catalytic Domain
Mol. Mass.:
25124.85
Organism:
Homo sapiens (Human)
Description:
Q99720
Residue:
223
  
Inhibitor
Name:
BDBM50037486
Synonyms:
(6S,11S)-6,11-Dimethyl-3-nonyl-1,2,3,4,5,6-hexahydro-2,6-methano-benzo[d]azocin-8-ol | CHEMBL117321
Type:
Small organic molecule
Emp. Form.:
C23H37NO
Mol. Mass.:
343.546
SMILES:
CCCCCCCCCN1CC[C@@]2(C)[C@H](C)C1Cc1ccc(O)cc21
: