Target
Adenosylhomocysteinase
Ligand
BDBM50368896
Substrate
Meas. Tech.
ChEMBL_196551 (CHEMBL801946)
Ki
96±n/a nM
Citation
 Wnuk, SFYuan, CSBorchardt, RTBalzarini, JDe Clercq, ERobins, MJ Nucleic acid related compounds. 84. Synthesis of 6'-(E and Z)-halohomovinyl derivatives of adenosine, inactivation of S-adenosyl-L-homocysteine hydrolase, and correlation of anticancer and antiviral potencies with enzyme inhibition. J Med Chem 37:3579-87 (1994)  
Target
Name:
Adenosylhomocysteinase
Synonyms:
AHCY SAHH | SAHH_HUMAN
Type:
PROTEIN
Mol. Mass.:
47714.06
Organism:
Homo sapiens (Human)
Description:
ChEMBL_1507791
Residue:
432
  
Inhibitor
Name:
BDBM50368896
Synonyms:
CHEMBL608056
Type:
Small organic molecule
Emp. Form.:
C11H12IN5O3
Mol. Mass.:
389.1492
SMILES:
Nc1ncnc2n(cnc12)C1O[C@H](\C=C\I)[C@@H](O)[C@H]1O
: