Target
Adenosine receptor A3
Ligand
BDBM50368540
Substrate
Meas. Tech.
ChEMBL_30614 (CHEMBL642021)
Ki
16±n/a nM
Citation
 Kim, HOJi, XDSiddiqi, SMOlah, MEStiles, GLJacobson, KA 2-Substitution of N6-benzyladenosine-5'-uronamides enhances selectivity for A3 adenosine receptors. J Med Chem 37:3614-21 (1994)  
Target
Name:
Adenosine receptor A3
Synonyms:
AA3R_RAT Adenosine receptor A2a and A3 | Adora3
Type:
PROTEIN
Mol. Mass.:
36643.73
Organism:
Rattus norvegicus
Description:
ChEMBL_479910
Residue:
320
  
Inhibitor
Name:
BDBM50368540
Synonyms:
CHEMBL609534
Type:
Small organic molecule
Emp. Form.:
C18H21IN6O4
Mol. Mass.:
512.3016
SMILES:
Nc1ccc(CCNc2ncnc3n(cnc23)C2O[C@H](CO)[C@@H](O)[C@H]2O)cc1I
: