Target
Neutral alpha-glucosidase C
Ligand
BDBM18351
Substrate
Meas. Tech.
ChEMBL_34407 (CHEMBL647805)
IC50
34000±n/a nM
Citation
 Asano, NOseki, KKizu, HMatsui, K Nitrogen-in-the-ring pyranoses and furanoses: structural basis of inhibition of mammalian glycosidases. J Med Chem 37:3701-6 (1994)  
Target
Name:
Neutral alpha-glucosidase C
Synonyms:
GANC_MOUSE | Ganc
Type:
PROTEIN
Mol. Mass.:
102002.29
Organism:
Mus musculus
Description:
ChEMBL_34410
Residue:
898
  
Inhibitor
Name:
BDBM18351
Synonyms:
(2R,3R,4R,5S)-2-(Hydroxymethyl)piperidine-3,4,5-triol, 10 1-Deoxynojirimycin CHEMBL307429 US9181184, 1 | dNM
Type:
natural product
Emp. Form.:
C6H13NO4
Mol. Mass.:
163.1717
SMILES:
OC[C@H]1NC[C@H](O)[C@@H](O)[C@@H]1O
: