Target
Beta-galactosidase
Ligand
BDBM18351
Substrate
Meas. Tech.
ChEMBL_37310 (CHEMBL651896)
IC50
390000±n/a nM
Citation
 Asano, NOseki, KKizu, HMatsui, K Nitrogen-in-the-ring pyranoses and furanoses: structural basis of inhibition of mammalian glycosidases. J Med Chem 37:3701-6 (1994)  
Target
Name:
Beta-galactosidase
Synonyms:
Type:
PROTEIN
Mol. Mass.:
73233.14
Organism:
Rattus norvegicus
Description:
ChEMBL_37308
Residue:
647
  
Inhibitor
Name:
BDBM18351
Synonyms:
(2R,3R,4R,5S)-2-(Hydroxymethyl)piperidine-3,4,5-triol, 10 1-Deoxynojirimycin CHEMBL307429 US9181184, 1 | dNM
Type:
natural product
Emp. Form.:
C6H13NO4
Mol. Mass.:
163.1717
SMILES:
OC[C@H]1NC[C@H](O)[C@@H](O)[C@@H]1O
: