Target
Pepsin A
Ligand
BDBM50040385
Substrate
Meas. Tech.
ChEMBL_153985 (CHEMBL762336)
IC50
>10000±n/a nM
Citation
 Raddatz, PMinck, KORippmann, FSchmitges, CJ Non-peptide renin inhibitors containing 2-(((3-phenylpropyl)phosphoryl)oxy)alkanoic acid moieties as P2-P3 replacements. J Med Chem 37:486-97 (1994)  
Target
Name:
Pepsin A
Synonyms:
PEPA_PIG Pepsin | Pepsin A precursor
Type:
Enzyme
Mol. Mass.:
41232.87
Organism:
Porcine
Description:
Residue:
385
  
Inhibitor
Name:
BDBM50040385
Synonyms:
(3-Phenyl-propyl)-phosphonic acid (R)-1-((1S,2R,3S)-1-cyclohexylmethyl-2,3-dihydroxy-5-methyl-hexylcarbamoyl)-butyl ester ethyl ester | CHEMBL356494
Type:
Small organic molecule
Emp. Form.:
C30H52NO6P
Mol. Mass.:
553.7107
SMILES:
CCC[C@@H](OP(=O)(CCCc1ccccc1)OCC)C(=O)N[C@@H](CC1CCCCC1)[C@@H](O)[C@@H](O)CC(C)C
: