Target
Cholecystokinin receptor type A
Ligand
BDBM50004474
Substrate
Meas. Tech.
ChEMBL_49710 (CHEMBL661162)
IC50
0.770000±n/a nM
Citation
 Holladay, MWKopecka, HMiller, TRBednarz, LNikkel, ALBianchi, BRWitte, DGShiosaki, KLin, CWAsin, KE Tetrapeptide CCK-A agonists: effect of backbone N-methylations on in vitro and in vivo CCK activity. J Med Chem 37:630-5 (1994)  
Target
Name:
Cholecystokinin receptor type A
Synonyms:
CCK-A receptor CCK1-R CCKAR_CAVPO Cholecystokinin receptor type A | Cholecystokinin-1 receptor
Type:
Mol. Mass.:
48229.77
Organism:
Cavia porcellus
Description:
Residue:
430
  
Inhibitor
Name:
BDBM50004474
Synonyms:
CCK7 analogue N-(1-Carbamoyl-2-phenyl-ethyl)-3-{2-[3-(1H-indol-3-yl)-2-(2-{2-[3-(4-sulfonyl-oxy-phenyl)-propionylamino]-hexanoylamino}-acetylamino)-propionylamino]-hexanoylamino}-succinamic acid
Type:
Small organic molecule
Emp. Form.:
C47H60N8O13S
Mol. Mass.:
977.09
SMILES:
CCCC[C@H](NC(=O)CCc1ccc(OS(O)(=O)=O)cc1)C(=O)NCC(=O)N[C@@H](Cc1c[nH]c2ccccc12)C(=O)N[C@@H](CCCC)C(=O)N[C@@H](CC(O)=O)C(=O)N[C@@H](Cc1ccccc1)C(N)=O
: