Target
Cholecystokinin receptor type A
Ligand
BDBM50040666
Substrate
Meas. Tech.
ChEMBL_50197 (CHEMBL663490)
IC50
1797±n/a nM
Citation
 Showell, GABourrain, SNeduvelil, JGFletcher, SRBaker, RWatt, APFletcher, AEFreedman, SBKemp, JAMarshall, GR High-affinity and potent, water-soluble 5-amino-1,4-benzodiazepine CCKB/gastrin receptor antagonists containing a cationic solubilizing group. J Med Chem 37:719-21 (1994)  
Target
Name:
Cholecystokinin receptor type A
Synonyms:
CCKAR_RAT Cholecystokinin peripheral Cholecystokinin receptor type A
Type:
Enzyme Catalytic Domain
Mol. Mass.:
49676.37
Organism:
RAT
Description:
Cholecystokinin central 0 RAT::P30551
Residue:
444
  
Inhibitor
Name:
BDBM50040666
Synonyms:
1-((R)-5-Cyclohexyl-1-methyl-2-oxo-2,3-dihydro-1H-benzo[e][1,4]diazepin-3-yl)-3-m-tolyl-urea L-708474
Type:
Small organic molecule
Emp. Form.:
C24H28N4O2
Mol. Mass.:
404.5047
SMILES:
CN1c2ccccc2C(=N[C@@H](NC(=O)Nc2cccc(C)c2)C1=O)C1CCCCC1
: