Target
Geranylgeranyl transferase type-1 subunit beta/Protein farnesyltransferase/geranylgeranyltransferase type-1 subunit alpha
Ligand
BDBM50040685
Substrate
Meas. Tech.
ChEMBL_71814 (CHEMBL683645)
IC50
1100±n/a nM
Citation
 Graham, SLdeSolms, SJGiuliani, EAKohl, NEMosser, SDOliff, AIPompliano, DLRands, EBreslin, MJDeana, AA Pseudopeptide inhibitors of Ras farnesyl-protein transferase. J Med Chem 37:725-32 (1994)  
Target
Name:
Geranylgeranyl transferase type-1 subunit beta/Protein farnesyltransferase/geranylgeranyltransferase type-1 subunit alpha
Synonyms:
Geranylgeranyl Transferase (GGTase-I) Geranylgeranyl transferase type I
Type:
Protein Complex
Mol. Mass.:
Description:
Components:
This complex has 2 components.
Component 1
Name:
Protein farnesyltransferase/geranylgeranyltransferase type-1 subunit alpha
Synonyms:
CAAX farnesyltransferase alpha subunit FNTA_BOVIN GGTase-I-alpha Protein Farnesyltransferase (PFT) Chain A Protein farnesyltransferase/geranylgeranyltransferase type I alpha subunit Type I protein geranyl-geranyltransferase alpha subunit
Type:
Enzyme
Mol. Mass.:
43827.38
Organism:
Bos taurus (bovine)
Description:
The enzyme was purified from a bovine brain homogenate by sequential ammonium sulfate fractionation and affinity chromatography.
Residue:
375
  
Component 2
Name:
Geranylgeranyl transferase type-1 subunit beta
Synonyms:
GGTase-I-beta Geranylgeranyl transferase type-1 subunit beta PGTB1_BOVIN | Type I protein geranyl-geranyltransferase subunit beta
Type:
Enzyme
Mol. Mass.:
42483.88
Organism:
Bos taurus (bovine)
Description:
Purified from bovine brain
Residue:
377
  
Inhibitor
Name:
BDBM50040685
Synonyms:
(S)-2-{(S)-2-[(S)-2-(2-Amino-3-mercapto-propylamino)-3-methyl-pentanoylamino]-3-phenyl-propylamino}-4-methylsulfanyl-butyric acid | CHEMBL166022
Type:
Small organic molecule
Emp. Form.:
C23H40N4O3S2
Mol. Mass.:
484.719
SMILES:
CCC(C)[C@H](NCC(N)CS)C(=O)N[C@H](CN[C@@H](CCSC)C(O)=O)Cc1ccccc1
: