Target
Delta-type opioid receptor
Ligand
BDBM50041148
Substrate
Meas. Tech.
ChEMBL_146496 (CHEMBL754606)
Ki
28±n/a nM
Citation
 Schmidt, RVogel, DMrestani-Klaus, CBrandt, WNeubert, KChung, NNLemieux, CSchiller, PW Cyclic beta-casomorphin analogues with mixed mu agonist/delta antagonist properties: synthesis, pharmacological characterization, and conformational aspects. J Med Chem 37:1136-44 (1994)  
Target
Name:
Delta-type opioid receptor
Synonyms:
Cytochrome P450 3A4 Delta opioid receptor Delta-type opioid receptor (DOR) OPRD_RAT Opioid receptor Opioid receptors; mu & delta Ror-a | Voltage-gated potassium channel
Type:
G Protein-Coupled Receptor (GPCR)
Mol. Mass.:
40465.04
Organism:
Rattus norvegicus (rat)
Description:
Competition binding assays were using CHO-K1 cell membranes expressing the opioid receptor.
Residue:
372
  
Inhibitor
Name:
BDBM50041148
Synonyms:
(S)-2-Amino-3-(4-hydroxy-phenyl)-N-((5S,8S,13aR)-5-naphthalen-2-ylmethyl-4,7,13-trioxo-tetradecahydro-3a,6,12-triaza-cyclopentacyclododecen-8-yl)-propionamide | CHEMBL280264
Type:
Small organic molecule
Emp. Form.:
C32H37N5O5
Mol. Mass.:
571.6667
SMILES:
N[C@@H](Cc1ccc(O)cc1)C(=O)N[C@H]1CCCNC(=O)[C@H]2CCCN2C(=O)[C@H](Cc2ccc3ccccc3c2)NC1=O
: