Target
Sigma non-opioid intracellular receptor 1
Ligand
BDBM50035135
Substrate
Meas. Tech.
ChEMBL_202050 (CHEMBL809523)
IC50
0.340000±n/a nM
Citation
 Moltzen, EKPerregaard, JMeier, E Sigma ligands with subnanomolar affinity and preference for the sigma 2 binding site. 2. Spiro-joined benzofuran, isobenzofuran, and benzopyran piperidines. J Med Chem 38:2009-17 (1995)  
Target
Name:
Sigma non-opioid intracellular receptor 1
Synonyms:
Opioid receptor SGMR1_RAT Sigma non-opioid intracellular receptor 1 Sigma-1 | Sigmar1
Type:
Enzyme Catalytic Domain
Mol. Mass.:
25266.54
Organism:
RAT
Description:
Q9R0C9
Residue:
223
  
Inhibitor
Name:
BDBM50035135
Synonyms:
1'-{4-[1-(4-fluorophenyl)-1H-3-indolyl]butyl}spiro[3,4-dihydro-1H-isochromene-4,4'-(hexahydropyridine)] | CHEMBL63999
Type:
Small organic molecule
Emp. Form.:
C31H33FN2O
Mol. Mass.:
468.6049
SMILES:
Fc1ccc(cc1)-n1cc(CCCCN2CCC3(CC2)COCc2ccccc32)c2ccccc12
: