Target
Neprilysin
Ligand
BDBM50105264
Substrate
Meas. Tech.
ChEMBL_144456 (CHEMBL755103)
IC50
1±n/a nM
Citation
 Bihovsky, RLevinson, BLLoewi, RCErhardt, PWPolokoff, MA Hydroxamic acids as potent inhibitors of endothelin-converting enzyme from human bronchiolar smooth muscle. J Med Chem 38:2119-29 (1995)  
Target
Name:
Neprilysin
Synonyms:
Atriopeptidase CD_antigen=CD10 MME NEP_RABIT Neutral endopeptidase 24.11
Type:
Enzyme
Mol. Mass.:
85570.75
Organism:
Oryctolagus cuniculus (rabbit)
Description:
NEP was purified to homogeneity from rabbit kidney.
Residue:
750
  
Inhibitor
Name:
BDBM50105264
Synonyms:
2-(2-Benzyl-3-hydroxycarbamoyl-propionylamino)-propionic acid anion
Type:
Small organic molecule
Emp. Form.:
C14H17N2O5
Mol. Mass.:
293.2957
SMILES:
C[C@H](NC(=O)[C@@H](CC(=O)NO)Cc1ccccc1)C([O-])=O
: