Target
Alpha-1D adrenergic receptor
Ligand
BDBM50453799
Substrate
Meas. Tech.
ChEMBL_32443 (CHEMBL646104)
Ki
191±n/a nM
Citation
 Ruffolo, RRBondinell, WHieble, JP Alpha- and beta-adrenoceptors: from the gene to the clinic. 2. Structure-activity relationships and therapeutic applications. J Med Chem 38:3681-716 (1995)  
Target
Name:
Alpha-1D adrenergic receptor
Synonyms:
ADA1D_HUMAN ADRA1D Adrenergic receptor alpha Alpha 1D-adrenoreceptor Alpha-1D adrenoceptor adrenergic Alpha1D
Type:
Enzyme Catalytic Domain
Mol. Mass.:
60485.82
Organism:
Homo sapiens (Human)
Description:
adrenergic Alpha1D ADRA1D HUMAN::P25100
Residue:
572
  
Inhibitor
Name:
BDBM50453799
Synonyms:
Niguldipine
Type:
Small organic molecule
Emp. Form.:
C36H39N3O6
Mol. Mass.:
609.7114
SMILES:
COC(=O)C1=C(C)NC(C)=C([C@H]1c1cccc(c1)[N+]([O-])=O)C(=O)OCCCN1CCC(CC1)(c1ccccc1)c1ccccc1
: