Target
Alpha-2B adrenergic receptor
Ligand
BDBM50030624
Substrate
Meas. Tech.
ChEMBL_33355 (CHEMBL644759)
Ki
758±n/a nM
Citation
 Ruffolo, RRBondinell, WHieble, JP Alpha- and beta-adrenoceptors: from the gene to the clinic. 2. Structure-activity relationships and therapeutic applications. J Med Chem 38:3681-716 (1995)  
Target
Name:
Alpha-2B adrenergic receptor
Synonyms:
ADA2B_HUMAN ADRA2L1 Adrenergic alpha2B Adrenergic receptor alpha Alpha-2 adrenergic receptor subtype C2 Alpha-2B adrenoreceptor | Alpha-2BAR
Type:
Enzyme
Mol. Mass.:
49964.20
Organism:
Homo sapiens (Human)
Description:
P18089
Residue:
450
  
Inhibitor
Name:
BDBM50030624
Synonyms:
2,6-Dimethyl-4-(4-nitro-phenyl)-pyridine-3,5-dicarboxylic acid 3-[3-(4,4-diphenyl-piperidin-1-yl)-propyl] ester 5-methyl ester | CHEMBL123769
Type:
Small organic molecule
Emp. Form.:
C36H37N3O6
Mol. Mass.:
607.6955
SMILES:
COC(=O)c1c(C)nc(C)c(C(=O)OCCCN2CCC(CC2)(c2ccccc2)c2ccccc2)c1-c1ccc(cc1)[N+]([O-])=O
: