Target
Alpha-1B adrenergic receptor
Ligand
BDBM50453799
Substrate
Meas. Tech.
ChEMBL_34343 (CHEMBL649156)
Ki
85±n/a nM
Citation
 Ruffolo, RRBondinell, WHieble, JP Alpha- and beta-adrenoceptors: from the gene to the clinic. 2. Structure-activity relationships and therapeutic applications. J Med Chem 38:3681-716 (1995)  
Target
Name:
Alpha-1B adrenergic receptor
Synonyms:
ADA1B_HUMAN Adrenergic alpha1B Adrenergic receptor alpha Alpha 1B-adrenoreceptor | Alpha-1B adrenergic receptor
Type:
Enzyme
Mol. Mass.:
56862.13
Organism:
Homo sapiens (Human)
Description:
P35368
Residue:
520
  
Inhibitor
Name:
BDBM50453799
Synonyms:
Niguldipine
Type:
Small organic molecule
Emp. Form.:
C36H39N3O6
Mol. Mass.:
609.7114
SMILES:
COC(=O)C1=C(C)NC(C)=C([C@H]1c1cccc(c1)[N+]([O-])=O)C(=O)OCCCN1CCC(CC1)(c1ccccc1)c1ccccc1
: