Target
Alpha-2A adrenergic receptor
Ligand
BDBM66983
Substrate
Meas. Tech.
ChEMBL_33074 (CHEMBL647721)
Ki
9.4±n/a nM
Citation
 Ruffolo, RRBondinell, WHieble, JP Alpha- and beta-adrenoceptors: from the gene to the clinic. 2. Structure-activity relationships and therapeutic applications. J Med Chem 38:3681-716 (1995)  
Target
Name:
Alpha-2A adrenergic receptor
Synonyms:
ADA2A_HUMAN ADRA2R Adrenergic alpha2A Alpha-2 adrenergic receptor subtype C10 Alpha-2A adrenoreceptor alpha-2A adrenergic receptor [Homo sapiens]
Type:
Enzyme
Mol. Mass.:
48979.91
Organism:
Homo sapiens (Human)
Description:
P08913
Residue:
465
  
Inhibitor
Name:
BDBM66983
Synonyms:
6-chloranyl-3-methyl-1,2,4,5-tetrahydro-3-benzazepine;hydrochloride CHEMBL123349 SKF 86466 SMR001254100 | cid_10220250
Type:
Small organic molecule
Emp. Form.:
C11H14ClN
Mol. Mass.:
195.689
SMILES:
CN1CCc2cccc(Cl)c2CC1
: