Target
Transporter
Ligand
BDBM50366564
Substrate
Meas. Tech.
ChEMBL_142944 (CHEMBL750796)
IC50
920±n/a nM
Citation
 Carroll, FIKotian, PDehghani, AGray, JLKuzemko, MAParham, KAAbraham, PLewin, AHBoja, JWKuhar, MJ Cocaine and 3 beta-(4'-substituted phenyl)tropane-2 beta-carboxylic acid ester and amide analogues. New high-affinity and selective compounds for the dopamine transporter. J Med Chem 38:379-88 (1995)  
Target
Name:
Transporter
Synonyms:
Monoamine transporters; Norepininephrine & dopamine | Norepinephrine Monoamine transporters
Type:
PROTEIN
Mol. Mass.:
66787.87
Organism:
Rattus norvegicus
Description:
ChEMBL_1463061
Residue:
597
  
Inhibitor
Name:
BDBM50366564
Synonyms:
CHEMBL1790051 WIN-35065-2
Type:
Small organic molecule
Emp. Form.:
C16H21NO2
Mol. Mass.:
259.3434
SMILES:
COC(=O)[C@@H]1C2CC[C@H](C[C@@H]1c1ccccc1)N2C
: