Target
Muscarinic acetylcholine receptor M1
Ligand
BDBM50453907
Substrate
Meas. Tech.
ChEMBL_138945 (CHEMBL745925)
Ki
7.1±n/a nM
Citation
 Newman, AHKline, RHAllen, ACIzenwasser, SGeorge, CKatz, JL Novel 4'-substituted and 4',4"-disubstituted 3 alpha-(diphenylmethoxy)tropane analogs as potent and selective dopamine uptake inhibitors. J Med Chem 38:3933-40 (1995)  
Target
Name:
Muscarinic acetylcholine receptor M1
Synonyms:
ACM1_RAT Chrm-1 cholinergic receptor, muscarinic 1
Type:
Enzyme Catalytic Domain
Mol. Mass.:
51390.46
Organism:
RAT
Description:
P08482
Residue:
460
  
Inhibitor
Name:
BDBM50453907
Synonyms:
CHEMBL3084900
Type:
Small organic molecule
Emp. Form.:
C22H24N2O
Mol. Mass.:
332.4388
SMILES:
[H][C@]12CC[C@]([H])(C[C@@H](C1)OC(c1ccccc1)c1ccc(cc1)C#N)N2C
: