Target
Adenosine receptor A1
Ligand
BDBM50453913
Substrate
Meas. Tech.
ChEMBL_29482 (CHEMBL641716)
Ki
470±n/a nM
Citation
 van der Wenden, EMvon Frijtag Drabbe Künzel, JKMathôt, RADanhof, MIJzerman, APSoudijn, W Ribose-modified adenosine analogues as potential partial agonists for the adenosine receptor. J Med Chem 38:4000-6 (1995)  
Target
Name:
Adenosine receptor A1
Synonyms:
AA1R_RAT ADENOSINE A1 high Adenosine A1 receptor (A1) Adenosine receptors A1 | Adora1
Type:
Protein
Mol. Mass.:
36704.13
Organism:
Rattus norvegicus (rat)
Description:
Residue:
326
  
Inhibitor
Name:
BDBM50453913
Synonyms:
CHEMBL2112619
Type:
Small organic molecule
Emp. Form.:
C15H21N5O3
Mol. Mass.:
319.3589
SMILES:
OC[C@@H]1C[C@@H](O)[C@@H](O1)n1cnc2c(NC3CCCC3)ncnc12
: