Target
Adenosine deaminase
Ligand
BDBM50031268
Substrate
Meas. Tech.
ChEMBL_30794 (CHEMBL645070)
Ki
2500±n/a nM
Citation
 Cristalli, GVittori, SEleuteri, AVolpini, RCamaioni, ELupidi, GMahmood, NBevilacqua, FPalù, G Synthesis and biological evaluation of N6-cycloalkyl derivatives of 1-deazaadenine nucleosides: a new class of anti-human immunodeficiency virus agents. J Med Chem 38:4019-25 (1995)  
Target
Name:
Adenosine deaminase
Synonyms:
ADA Adenosine aminohydrolase
Type:
Enzyme
Mol. Mass.:
40910.44
Organism:
Bos taurus (bovine)
Description:
Residue:
363
  
Inhibitor
Name:
BDBM50031268
Synonyms:
CHEMBL336531 | [5-(7-Amino-imidazo[4,5-b]pyridin-3-yl)-tetrahydro-furan-2-yl]-methanol
Type:
Small organic molecule
Emp. Form.:
C11H14N4O2
Mol. Mass.:
234.2545
SMILES:
Nc1ccnc2n(cnc12)C1CCC(CO)O1
: