Target
Adenosine deaminase
Ligand
BDBM50031285
Substrate
Meas. Tech.
ChEMBL_30794 (CHEMBL645070)
Ki
>100000±n/a nM
Citation
 Cristalli, GVittori, SEleuteri, AVolpini, RCamaioni, ELupidi, GMahmood, NBevilacqua, FPalù, G Synthesis and biological evaluation of N6-cycloalkyl derivatives of 1-deazaadenine nucleosides: a new class of anti-human immunodeficiency virus agents. J Med Chem 38:4019-25 (1995)  
Target
Name:
Adenosine deaminase
Synonyms:
ADA Adenosine aminohydrolase
Type:
Enzyme
Mol. Mass.:
40910.44
Organism:
Bos taurus (bovine)
Description:
Residue:
363
  
Inhibitor
Name:
BDBM50031285
Synonyms:
5-(5-Chloro-7-cycloheptylamino-imidazo[4,5-b]pyridin-3-yl)-2-hydroxymethyl-tetrahydro-furan-3-ol | CHEMBL315831
Type:
Small organic molecule
Emp. Form.:
C18H25ClN4O3
Mol. Mass.:
380.869
SMILES:
OCC1OC(CC1O)n1cnc2c(NC3CCCCCC3)cc(Cl)nc12
: