Target
D(2) dopamine receptor
Ligand
BDBM50029325
Substrate
Meas. Tech.
ChEMBL_62395 (CHEMBL672950)
Ki
117±n/a nM
Citation
 Reitz, ABBaxter, EWBennett, DJCodd, EEJordan, ADMalloy, EAMaryanoff, BEMcDonnell, MEOrtegon, MERenzi, MJ N-aryl-N'-benzylpiperazines as potential antipsychotic agents. J Med Chem 38:4211-22 (1995)  
Target
Name:
D(2) dopamine receptor
Synonyms:
DOPAMINE D2 DOPAMINE D2 Short Dopamine D2 receptor Drd2
Type:
G Protein-Coupled Receptor (GPCR)
Mol. Mass.:
50931.60
Organism:
Rattus norvegicus (rat)
Description:
P61169
Residue:
444
  
Inhibitor
Name:
BDBM50029325
Synonyms:
(4-Fluoro-phenyl)-{3-[4-(2-isopropoxy-phenyl)-piperazin-1-ylmethyl]-benzyl}-amine | CHEMBL135479
Type:
Small organic molecule
Emp. Form.:
C27H32FN3O
Mol. Mass.:
433.5609
SMILES:
CC(C)Oc1ccccc1N1CCN(Cc2cccc(CNc3ccc(F)cc3)c2)CC1
: