Target
D(2) dopamine receptor
Ligand
BDBM50029312
Substrate
Meas. Tech.
ChEMBL_63038 (CHEMBL678341)
Ki
302±n/a nM
Citation
 Reitz, ABBaxter, EWBennett, DJCodd, EEJordan, ADMalloy, EAMaryanoff, BEMcDonnell, MEOrtegon, MERenzi, MJ N-aryl-N'-benzylpiperazines as potential antipsychotic agents. J Med Chem 38:4211-22 (1995)  
Target
Name:
D(2) dopamine receptor
Synonyms:
DOPAMINE D2 DOPAMINE D2 Short Dopamine D2 receptor Drd2
Type:
G Protein-Coupled Receptor (GPCR)
Mol. Mass.:
50931.60
Organism:
Rattus norvegicus (rat)
Description:
P61169
Residue:
444
  
Inhibitor
Name:
BDBM50029312
Synonyms:
1-(2-Isopropoxy-phenyl)-4-(3-methyl-benzyl)-piperazine | CHEMBL439607
Type:
Small organic molecule
Emp. Form.:
C21H28N2O
Mol. Mass.:
324.4598
SMILES:
CC(C)Oc1ccccc1N1CCN(Cc2cccc(C)c2)CC1
: