Target
D(2) dopamine receptor
Ligand
BDBM50029304
Substrate
Meas. Tech.
ChEMBL_62395 (CHEMBL672950)
Ki
23±n/a nM
Citation
 Reitz, ABBaxter, EWBennett, DJCodd, EEJordan, ADMalloy, EAMaryanoff, BEMcDonnell, MEOrtegon, MERenzi, MJ N-aryl-N'-benzylpiperazines as potential antipsychotic agents. J Med Chem 38:4211-22 (1995)  
Target
Name:
D(2) dopamine receptor
Synonyms:
DOPAMINE D2 DOPAMINE D2 Short Dopamine D2 receptor Drd2
Type:
G Protein-Coupled Receptor (GPCR)
Mol. Mass.:
50931.60
Organism:
Rattus norvegicus (rat)
Description:
P61169
Residue:
444
  
Inhibitor
Name:
BDBM50029304
Synonyms:
1-(2-Isopropoxy-phenyl)-4-(4-pyrrolidin-1-ylmethyl-benzyl)-piperazine | CHEMBL135246
Type:
Small organic molecule
Emp. Form.:
C25H35N3O
Mol. Mass.:
393.5649
SMILES:
CC(C)Oc1ccccc1N1CCN(Cc2ccc(CN3CCCC3)cc2)CC1
: