Target
D(1A) dopamine receptor
Ligand
BDBM50029347
Substrate
Meas. Tech.
ChEMBL_58517 (CHEMBL672012)
Ki
1490±n/a nM
Citation
 Shah, JHIzenwasser, SGeter-Douglass, BWitkin, JMNewman, AH (+/-)-(N-alkylamino)benzazepine analogs: novel dopamine D1 receptor antagonists. J Med Chem 38:4284-93 (1995)  
Target
Name:
D(1A) dopamine receptor
Synonyms:
DOPAMINE D1 Dopamine D1 high Dopamine receptor Dopamine1-like Drd1a
Type:
Enzyme Catalytic Domain
Mol. Mass.:
49429.75
Organism:
RAT
Description:
P18901
Residue:
446
  
Inhibitor
Name:
BDBM50029347
Synonyms:
8-Bromo-3-(4-dimethylamino-butyl)-5-phenyl-2,3,4,5-tetrahydro-1H-benzo[d]azepin-7-ol | CHEMBL135616
Type:
Small organic molecule
Emp. Form.:
C22H29BrN2O
Mol. Mass.:
417.382
SMILES:
CN(C)CCCCN1CCc2cc(Br)c(O)cc2C(C1)c1ccccc1
: