Target
Ornithine decarboxylase
Ligand
BDBM50029364
Substrate
Meas. Tech.
ChEMBL_148132 (CHEMBL753381)
Ki
6100000±n/a nM
Citation
 Aizencang, GFrydman, RBGiorgieri, SSambrotta, LGuerra, LFrydman, B Synthesis of isoornithines and methylputrescines. An evaluation of their inhibitory effects on ornithine decarboxylase. J Med Chem 38:4337-41 (1995)  
Target
Name:
Ornithine decarboxylase
Synonyms:
DCOR_RAT Odc1
Type:
PROTEIN
Mol. Mass.:
51037.04
Organism:
Rattus norvegicus
Description:
ChEMBL_1344641
Residue:
461
  
Inhibitor
Name:
BDBM50029364
Synonyms:
2,3-dimethyl-1,4-butanediammonium
Type:
Small organic molecule
Emp. Form.:
C6H18N2
Mol. Mass.:
118.2194
SMILES:
CC(C[NH3+])C(C)C[NH3+]
: