Target
Acetylcholinesterase
Ligand
BDBM50029917
Substrate
Meas. Tech.
ChEMBL_28910 (CHEMBL638608)
IC50
25±n/a nM
Citation
 Sugimoto, HIimura, YYamanishi, YYamatsu, K Synthesis and structure-activity relationships of acetylcholinesterase inhibitors: 1-benzyl-4-[(5,6-dimethoxy-1-oxoindan-2-yl)methyl]piperidine hydrochloride and related compounds. J Med Chem 38:4821-9 (1996)  
Target
Name:
Acetylcholinesterase
Synonyms:
ACES_MOUSE Acetylcholinesterase (mouse AChE) Ache
Type:
Enzyme
Mol. Mass.:
68165.65
Organism:
Mus musculus (mouse)
Description:
Residue:
614
  
Inhibitor
Name:
BDBM50029917
Synonyms:
2-(1-Benzyl-piperidin-4-ylmethyl)-5,7-dimethoxy-indan-1-one | CHEMBL356333
Type:
Small organic molecule
Emp. Form.:
C24H29NO3
Mol. Mass.:
379.492
SMILES:
COc1cc2CC(CC3CCN(Cc4ccccc4)CC3)C(=O)c2c(OC)c1
: