Target
Acetylcholinesterase
Ligand
BDBM50029932
Substrate
Meas. Tech.
ChEMBL_28910 (CHEMBL638608)
IC50
4±n/a nM
Citation
 Sugimoto, HIimura, YYamanishi, YYamatsu, K Synthesis and structure-activity relationships of acetylcholinesterase inhibitors: 1-benzyl-4-[(5,6-dimethoxy-1-oxoindan-2-yl)methyl]piperidine hydrochloride and related compounds. J Med Chem 38:4821-9 (1996)  
Target
Name:
Acetylcholinesterase
Synonyms:
ACES_MOUSE Acetylcholinesterase (mouse AChE) Ache
Type:
Enzyme
Mol. Mass.:
68165.65
Organism:
Mus musculus (mouse)
Description:
Residue:
614
  
Inhibitor
Name:
BDBM50029932
Synonyms:
5,6-Dimethoxy-2-[1-(3-nitro-benzyl)-piperidin-4-ylmethyl]-indan-1-one; hydrochloride CHEMBL557839
Type:
Small organic molecule
Emp. Form.:
C24H28N2O5
Mol. Mass.:
424.4895
SMILES:
COc1cc2CC(CC3CCN(Cc4cccc(c4)[N+]([O-])=O)CC3)C(=O)c2cc1OC
: